Target
Ribose-phosphate pyrophosphokinase 1
Ligand
BDBM493479
Substrate
Meas. Tech.
PRS Enzyme Activity Inhibition Experiment
IC50
300±n/a nM
Citation
 Lee, BCho, MLee, HJung, MOh, Y Heterocyclic compound, its preparation method, and pharmaceutical composition comprising the same US Patent  US10981917 Publication Date 4/20/2021 
Target
Name:
Ribose-phosphate pyrophosphokinase 1
Synonyms:
PRPS1 Ribose-phosphate pyrophosphokinase I
Type:
PROTEIN
Mol. Mass.:
34836.38
Organism:
Homo sapiens (Human)
Description:
ChEMBL_156521
Residue:
318
  
Inhibitor
Name:
BDBM493479
Synonyms:
US10981917, Example 180
Type:
Small organic molecule
Emp. Form.:
C16H20ClN3O
Mol. Mass.:
305.802
SMILES:
Cc1cc(Cl)cc2n(C\C=C\[C@H]3NCCC[C@@H]3O)cnc12
: