Target
Induced myeloid leukemia cell differentiation protein Mcl-1 [171-327]
Ligand
BDBM493783
Substrate
Meas. Tech.
AlphaLISA Assay
IC50
0.037±n/a nM
Citation
Target
Name:
Induced myeloid leukemia cell differentiation protein Mcl-1 [171-327]
Synonyms:
BCL2L3 MCL1 Myeloid cell leukemia 1 (Mcl-1)
Type:
Enzyme Catalytic Domain
Mol. Mass.:
17896.13
Organism:
Homo sapiens (Human)
Description:
Q07820[171-327]
Residue:
157
  
Inhibitor
Name:
BDBM493783
Synonyms:
US10988451, Example 253
Type:
Small organic molecule
Emp. Form.:
C37H47ClN4O6S
Mol. Mass.:
711.31
SMILES:
CO[C@@H]1CN([C@H]1C)C(=O)N[S@@]1(=O)=NC(=O)c2ccc3OC[C@]4(CCCc5cc(Cl)ccc45)CN(C[C@@H]4CC[C@H]4[C@@H](OC)\C=C\CCC1)c3c2
: