Target
Induced myeloid leukemia cell differentiation protein Mcl-1 [171-327]
Ligand
BDBM449670
Substrate
Meas. Tech.
AlphaLISA Assay
IC50
0.029±n/a nM
Citation
Target
Name:
Induced myeloid leukemia cell differentiation protein Mcl-1 [171-327]
Synonyms:
BCL2L3 MCL1 Myeloid cell leukemia 1 (Mcl-1)
Type:
Enzyme Catalytic Domain
Mol. Mass.:
17896.13
Organism:
Homo sapiens (Human)
Description:
Q07820[171-327]
Residue:
157
  
Inhibitor
Name:
BDBM449670
Synonyms:
US10703733, Example 283 US11643400, Example 283
Type:
Small organic molecule
Emp. Form.:
C39H48ClN5O7S
Mol. Mass.:
766.346
SMILES:
CO[C@H]1\C=C\[C@H](OC)[C@H](C)C[S@@](=O)(NC(=O)c2cn(C)nc2OC)=NC(=O)c2ccc3OC[C@]4(CCCc5cc(Cl)ccc45)CN(C[C@@H]4CC[C@@H]14)c3c2
: