Target
Induced myeloid leukemia cell differentiation protein Mcl-1 [171-327]
Ligand
BDBM449677
Substrate
Meas. Tech.
AlphaLISA Assay
IC50
0.030±n/a nM
Citation
Target
Name:
Induced myeloid leukemia cell differentiation protein Mcl-1 [171-327]
Synonyms:
BCL2L3 MCL1 Myeloid cell leukemia 1 (Mcl-1)
Type:
Enzyme Catalytic Domain
Mol. Mass.:
17896.13
Organism:
Homo sapiens (Human)
Description:
Q07820[171-327]
Residue:
157
  
Inhibitor
Name:
BDBM449677
Synonyms:
US10703733, Example 290 US11643400, Example 290
Type:
Small organic molecule
Emp. Form.:
C38H48ClN5O6S
Mol. Mass.:
738.336
SMILES:
COc1nn(C)cc1C(=O)N[S@@]1(=O)=NC(=O)c2ccc3OC[C@]4(CCCc5cc(Cl)ccc45)CN(C[C@@H]4CC[C@H]4[C@@H](O)CCC[C@H](C)[C@H]1C)c3c2
: