Target
Induced myeloid leukemia cell differentiation protein Mcl-1 [171-327]
Ligand
BDBM493822
Substrate
Meas. Tech.
AlphaLISA Assay
IC50
0.020±n/a nM
Citation
Target
Name:
Induced myeloid leukemia cell differentiation protein Mcl-1 [171-327]
Synonyms:
BCL2L3 MCL1 Myeloid cell leukemia 1 (Mcl-1)
Type:
Enzyme Catalytic Domain
Mol. Mass.:
17896.13
Organism:
Homo sapiens (Human)
Description:
Q07820[171-327]
Residue:
157
  
Inhibitor
Name:
BDBM493822
Synonyms:
US10988451, Example 292
Type:
Small organic molecule
Emp. Form.:
C38H48ClN5O7S
Mol. Mass.:
754.335
SMILES:
C[C@H]1C\C=C\[C@H](O)[C@@H]2CC[C@H]2CN2C[C@@]3(CCCc4cc(Cl)ccc34)COc3ccc(cc23)C(=O)N=[S@@](=O)(C1)NC(=O)N1CC(C1)OC(=O)N(C)C
: