Target
Induced myeloid leukemia cell differentiation protein Mcl-1 [171-327]
Ligand
BDBM449733
Substrate
Meas. Tech.
AlphaLISA Assay
IC50
0.031±n/a nM
Citation
Target
Name:
Induced myeloid leukemia cell differentiation protein Mcl-1 [171-327]
Synonyms:
BCL2L3 MCL1 Myeloid cell leukemia 1 (Mcl-1)
Type:
Enzyme Catalytic Domain
Mol. Mass.:
17896.13
Organism:
Homo sapiens (Human)
Description:
Q07820[171-327]
Residue:
157
  
Inhibitor
Name:
BDBM449733
Synonyms:
US10703733, Example 346 US11643400, Example 346
Type:
Small organic molecule
Emp. Form.:
C38H49ClN4O6S
Mol. Mass.:
725.337
SMILES:
COCC1CN(C1)C(=O)N[S@@]1(=O)=NC(=O)c2ccc3OC[C@]4(CCCc5cc(Cl)ccc45)CN(C[C@@H]4CC[C@H]4[C@@H](OC)\C=C\C[C@H](C)C1)c3c2
: