Target
Adenosine receptor A1
Ligand
BDBM493753
Substrate
Meas. Tech.
Binding Assay
Ki
0.447±n/a nM
Citation
 Congreve, MSAndrews, SPMason, JSRichardson, CMBrown, GA 1,2,4-triazine-4-amine derivatives US Patent  US10988455 Publication Date 4/27/2021 
Target
Name:
Adenosine receptor A1
Synonyms:
A1 adenosine receptor (hA1) AA1R_HUMAN ADORA1 Adenosine A1-receptor Adenosine receptor A1 (hA1) | Adenosine transporter (AdT)
Type:
G Protein-Coupled Receptor (GPCR)
Mol. Mass.:
36520.92
Organism:
Homo sapiens (Human)
Description:
P30542
Residue:
326
  
Inhibitor
Name:
BDBM493753
Synonyms:
US10988455, Example 1(lxxix)
Type:
Small organic molecule
Emp. Form.:
C17H15N5
Mol. Mass.:
289.3345
SMILES:
Nc1nnc(-c2ccnc(c2)C2CC2)c(n1)-c1ccccc1
: