Target
Adenosine receptor A2a
Ligand
BDBM50382496
Substrate
Meas. Tech.
Binding Assay
Ki
8.51±n/a nM
Citation
 Congreve, MSAndrews, SPMason, JSRichardson, CMBrown, GA 1,2,4-triazine-4-amine derivatives US Patent  US10988455 Publication Date 4/27/2021 
Target
Name:
Adenosine receptor A2a
Synonyms:
A2A adenosine receptor (hA2A) ADENOSINE A2 ADORA2 Adenosine A2A receptor (A2AAR)
Type:
G Protein-Coupled Receptor (GPCR)
Mol. Mass.:
44716.46
Organism:
Homo sapiens (Human)
Description:
P29274
Residue:
412
  
Inhibitor
Name:
BDBM50382496
Synonyms:
CHEMBL2024120 | US10988455, Example 1(cxciii)
Type:
Small organic molecule
Emp. Form.:
C16H11F4N5
Mol. Mass.:
349.2857
SMILES:
Cc1cc(cc(n1)C(F)(F)F)-c1nnc(N)nc1-c1ccc(F)cc1
: