Target
Delta-type opioid receptor
Ligand
BDBM494092
Substrate
Meas. Tech.
Competition Binding Assay
Ki
6.73±0.396 nM
Citation
 Zhang, YSelley, DEDewey, WAbkarali, H Potent and selective mu opioid receptor modulators US Patent  US10988481 Publication Date 4/27/2021 
Target
Name:
Delta-type opioid receptor
Synonyms:
D-OR-1 Delta opioid receptor OPIATE Delta OPRD1 OPRK1 | opioid receptor, delta 1
Type:
G Protein-Coupled Receptor (GPCR)
Mol. Mass.:
40382.98
Organism:
Homo sapiens (Human)
Description:
Competition binding assays were carried out using membrane preparations from transfected HN9.10 cells that constitutively expressed the delta opioid receptor.
Residue:
372
  
Inhibitor
Name:
BDBM494092
Synonyms:
US10988481, Compound 9
Type:
Small organic molecule
Emp. Form.:
C32H37N3O4
Mol. Mass.:
527.6539
SMILES:
Oc1ccc2C[C@H]3N(CC4CC4)CC[C@@]45[C@@H](Oc1c24)[C@H](CC[C@@]35O)NC(=O)CCCc1c[nH]c2ccccc12
: