Target
Mu-type opioid receptor
Ligand
BDBM493967
Substrate
Meas. Tech.
Competition Binding Assay
Ki
1.11±0.07 nM
Citation
 Zhang, YSelley, DEDewey, WAbkarali, H Potent and selective mu opioid receptor modulators US Patent  US10988481 Publication Date 4/27/2021 
Target
Name:
Mu-type opioid receptor
Synonyms:
M-OR-1 MOR-1 MUOR1 Mu opiate receptor OPRM1 hMOP | mu-type opioid receptor isoform MOR-1
Type:
G Protein-Coupled Receptor (GPCR)
Mol. Mass.:
44789.51
Organism:
Homo sapiens (Human)
Description:
P35372
Residue:
400
  
Inhibitor
Name:
BDBM493967
Synonyms:
US10988481, Compound NAQ
Type:
Small organic molecule
Emp. Form.:
C26H39N7O15P2
Mol. Mass.:
751.5733
SMILES:
CCC(O)[C@@H](C)[C@H]1C=CN(C=C1C(N)=O)[C@@H]1O[C@H](COP(O)(=O)OP(O)(=O)OC[C@H]2O[C@H]([C@H](O)[C@@H]2O)n2cnc3c(N)ncnc23)[C@@H](O)[C@H]1O
: