Target
Kappa-type opioid receptor
Ligand
BDBM494139
Substrate
Meas. Tech.
Competition Binding Assay
Ki
0.166±0.012 nM
Citation
 Zhang, YSelley, DEDewey, WAbkarali, H Potent and selective mu opioid receptor modulators US Patent  US10988481 Publication Date 4/27/2021 
Target
Name:
Kappa-type opioid receptor
Synonyms:
K-OR-1 Kappa-opioid receptor (KOR) Kappa-type opioid receptor (KOR) OPIATE Kappa OPRK1 kappa opioid receptor (KOR)
Type:
G Protein-Coupled Receptor (GPCR)
Mol. Mass.:
42648.76
Organism:
Homo sapiens (Human)
Description:
P41145
Residue:
380
  
Inhibitor
Name:
BDBM494139
Synonyms:
US10988481, Compound 14
Type:
Small organic molecule
Emp. Form.:
C28H29N3O4
Mol. Mass.:
471.5476
SMILES:
Oc1ccc2C[C@H]3N(CC[C@@]45C(Oc1c24)[C@@H](CC[C@@]35O)NC(=O)c1ccc2cc[nH]c2c1)C1CC1
: