Target
Mu-type opioid receptor
Ligand
BDBM494161
Substrate
Meas. Tech.
Competition Binding Assay
Ki
0.188±0.011 nM
Citation
 Zhang, YSelley, DEDewey, WAbkarali, H Potent and selective mu opioid receptor modulators US Patent  US10988481 Publication Date 4/27/2021 
Target
Name:
Mu-type opioid receptor
Synonyms:
M-OR-1 MOR-1 MUOR1 Mu opiate receptor OPRM1 hMOP | mu-type opioid receptor isoform MOR-1
Type:
G Protein-Coupled Receptor (GPCR)
Mol. Mass.:
44789.51
Organism:
Homo sapiens (Human)
Description:
P35372
Residue:
400
  
Inhibitor
Name:
BDBM494161
Synonyms:
US10988481, Compound 15
Type:
Small organic molecule
Emp. Form.:
C28H29N3O4
Mol. Mass.:
471.5476
SMILES:
Oc1ccc2C[C@H]3N(CC[C@@]45C(Oc1c24)[C@@H](CC[C@@]35O)NC(=O)c1cccc2cc[nH]c12)C1CC1
: