Target
Epidermal growth factor receptor [L858R]
Ligand
BDBM494877
Substrate
Meas. Tech.
TR-FRET Assay for ERBB Kinases
IC50
0.400±n/a nM
Citation
 Crew, APZimmermann, KWang, JCrews, CMJaime-Figueroa, SBurslem, G EGFR proteolysis targeting chimeric molecules and associated methods of use US Patent  US10994015 Publication Date 5/4/2021 
Target
Name:
Epidermal growth factor receptor [L858R]
Synonyms:
EGFR EGFR_HUMAN ERBB1 Epidermal growth factor receptor (L858R) HER1
Type:
Mol. Mass.:
134323.62
Organism:
Homo sapiens (Human)
Description:
P00533[L858R]
Residue:
1210
  
Inhibitor
Name:
BDBM494877
Synonyms:
US10994015, Example 11
Type:
Small organic molecule
Emp. Form.:
C36H32ClN7O5
Mol. Mass.:
678.136
SMILES:
Clc1ccccc1CNc1ncnc2[nH]c(cc12)-c1ccc(CCOCCNc2cccc3C(=O)N(C4CCC(=O)NC4=O)C(=O)c23)cc1
: