Target
Proteinase-activated receptor 2
Ligand
BDBM429544
Substrate
Meas. Tech.
IP-One HTRF Assay
IC50
900±n/a nM
Citation
 Cumming, JGWu, FXEdman, KHChen, HBrown, DGBurli, RWJohnstone, SDBrown, GATehan, BGTeobald, BJCongreve, MS Inhibitors of protease-activated receptor-2 US Patent  US10995072 Publication Date 5/4/2021 
Target
Name:
Proteinase-activated receptor 2
Synonyms:
F2RL1 PAR2 | PAR2_HUMAN
Type:
PROTEIN
Mol. Mass.:
44152.54
Organism:
Homo sapiens (Human)
Description:
ChEMBL_1497756
Residue:
397
  
Inhibitor
Name:
BDBM429544
Synonyms:
US10550089, Example 18 | US10995072, Example 18
Type:
Small organic molecule
Emp. Form.:
C14H14FN3O
Mol. Mass.:
259.2789
SMILES:
O[C@@H](c1ncc[nH]1)c1ccc(F)cc1N1CC=CC1
: