Target
Myeloperoxidase
Ligand
BDBM312251
Substrate
Meas. Tech.
Pharmacological Activity Assay
IC50
29.0±n/a nM
Citation
 Inghardt, TBJohannesson, PJurva, UMichaelsson, ELindstedt-Alstermark, ETomkinson, NStonehouse, JPGan, L 1-[2-(aminomethyl)benzyl]-2-thioxo-1,2,3,5-tetrahydro-4H-pyrrolo[3,2-d]pyrimidin-4-ones as inhibitors of myeloperoxidase US Patent  US11000525 Publication Date 5/11/2021 
Target
Name:
Myeloperoxidase
Synonyms:
84 kDa myeloperoxidase MPO Myeloperoxidase Myeloperoxidase heavy chain PERM_HUMAN
Type:
Enzyme
Mol. Mass.:
83888.32
Organism:
Homo sapiens (Human)
Description:
P05164
Residue:
745
  
Inhibitor
Name:
BDBM312251
Synonyms:
1-(2-{[(Cyclobutylmethyl)amino]methyl}benzyl)-2-thioxo-1,2,3,5-tetrahydro-4H-pyrrolo[3,2-d]pyrimidin-4-one US11000525, Example 9 | US9616063, 9
Type:
Small organic molecule
Emp. Form.:
C19H22N4OS
Mol. Mass.:
354.469
SMILES:
O=c1[nH]c(=S)n(Cc2ccccc2CNCC2CCC2)c2cc[nH]c12
: