Target
Myeloperoxidase
Ligand
BDBM312256
Substrate
Meas. Tech.
Pharmacological Activity Assay
IC50
10.00±n/a nM
Citation
 Inghardt, TBJohannesson, PJurva, UMichaelsson, ELindstedt-Alstermark, ETomkinson, NStonehouse, JPGan, L 1-[2-(aminomethyl)benzyl]-2-thioxo-1,2,3,5-tetrahydro-4H-pyrrolo[3,2-d]pyrimidin-4-ones as inhibitors of myeloperoxidase US Patent  US11000525 Publication Date 5/11/2021 
Target
Name:
Myeloperoxidase
Synonyms:
84 kDa myeloperoxidase MPO Myeloperoxidase Myeloperoxidase heavy chain PERM_HUMAN
Type:
Enzyme
Mol. Mass.:
83888.32
Organism:
Homo sapiens (Human)
Description:
P05164
Residue:
745
  
Inhibitor
Name:
BDBM312256
Synonyms:
1-{2-[(Cyclobutylamino)methyl]benzyl}-2-thioxo-1,2,3,5-tetrahydro-4H-pyrrolo[3,2-d]pyrimidin-4-one US11000525, Example 10 | US9616063, 10
Type:
Small organic molecule
Emp. Form.:
C18H20N4OS
Mol. Mass.:
340.443
SMILES:
O=c1[nH]c(=S)n(Cc2ccccc2CNC2CCC2)c2cc[nH]c12
: