Target
Thyroid peroxidase
Ligand
BDBM312256
Substrate
Meas. Tech.
Pharmacological Activity Assay
IC50
11000±n/a nM
Citation
 Inghardt, TBJohannesson, PJurva, UMichaelsson, ELindstedt-Alstermark, ETomkinson, NStonehouse, JPGan, L 1-[2-(aminomethyl)benzyl]-2-thioxo-1,2,3,5-tetrahydro-4H-pyrrolo[3,2-d]pyrimidin-4-ones as inhibitors of myeloperoxidase US Patent  US11000525 Publication Date 5/11/2021 
Target
Name:
Thyroid peroxidase
Synonyms:
PERT_HUMAN Thyroid peroxidase | Thyroid peroxidase (TPO)
Type:
Enzyme
Mol. Mass.:
102965.07
Organism:
Homo sapiens (Human)
Description:
P07202
Residue:
933
  
Inhibitor
Name:
BDBM312256
Synonyms:
1-{2-[(Cyclobutylamino)methyl]benzyl}-2-thioxo-1,2,3,5-tetrahydro-4H-pyrrolo[3,2-d]pyrimidin-4-one US11000525, Example 10 | US9616063, 10
Type:
Small organic molecule
Emp. Form.:
C18H20N4OS
Mol. Mass.:
340.443
SMILES:
O=c1[nH]c(=S)n(Cc2ccccc2CNC2CCC2)c2cc[nH]c12
: