Target
Tyrosine-protein phosphatase non-receptor type 11
Ligand
BDBM497145
Substrate
Meas. Tech.
Biochemical Assay
IC50
0.800±n/a nM
Citation
 Jorand-Lebrun, CBoivin, RJohnson, TWang, YXiao, YChen, XLinde, NMusch, DKumar, D Pyrimidinone derivatives as SHP2 antagonists US Patent  US11001561 Publication Date 5/11/2021 
Target
Name:
Tyrosine-protein phosphatase non-receptor type 11
Synonyms:
3.1.3.48 PTP-1D PTP2C Protein Tyrosine Phosphatase PPN11/Shp2 Protein-Tyrosine Phosphatase SHP-2 Protein-tyrosine phosphatase 2C SH-PTP3 SHP2 Src homology phosphatase 2 (SHP-2) Tyrosine-protein phosphatase non-receptor type 11 (SHP-2) | Tyrosine-protein phosphatase non-receptor type 11 (SHP2)
Type:
Protein phosphatase
Mol. Mass.:
68443.59
Organism:
Homo sapiens (Human)
Description:
Q06124
Residue:
593
  
Inhibitor
Name:
BDBM497145
Synonyms:
US11001561, Compound 119b | US11702392, Compound 119b
Type:
Small organic molecule
Emp. Form.:
C24H24Cl2N4O
Mol. Mass.:
455.38
SMILES:
Cc1nc(cc(=O)n1-c1cccc(Cl)c1Cl)N1CCC2(Cc3ccccc3[C@@H]2N)CC1
: