Target
Tyrosine-protein kinase TXK
Ligand
BDBM497963
Substrate
Meas. Tech.
In Vitro Assay
IC50
55±n/a nM
Citation
 Hudson, RBeausoleil, A Compounds and methods for modulating interleukin-2-inducible t-cell kinase US Patent  US11008314 Publication Date 5/18/2021 
Target
Name:
Tyrosine-protein kinase TXK
Synonyms:
PTK4 RLK TXK Tyrosine-protein kinase TXK (TXK)
Type:
Protein
Mol. Mass.:
61268.80
Organism:
Homo sapiens (Human)
Description:
P42681
Residue:
527
  
Inhibitor
Name:
BDBM497963
Synonyms:
US11008314, Compound 52
Type:
Small organic molecule
Emp. Form.:
C24H26N4O4S2
Mol. Mass.:
498.618
SMILES:
COc1cc(C)c(Sc2cnc(NC(=O)C3CC3)s2)cc1C(=O)N1C[C@@H]2CN([C@@H]2C1)C(=O)C=C
: