Target
Tyrosine-protein kinase JAK3
Ligand
BDBM497963
Substrate
Meas. Tech.
In Vitro Assay
IC50
5500±n/a nM
Citation
 Hudson, RBeausoleil, A Compounds and methods for modulating interleukin-2-inducible t-cell kinase US Patent  US11008314 Publication Date 5/18/2021 
Target
Name:
Tyrosine-protein kinase JAK3
Synonyms:
JAK-3 JAK3_HUMAN Janus kinase 3 (JAK3) L-JAK | Leukocyte janus kinase
Type:
Protein
Mol. Mass.:
125111.08
Organism:
Homo sapiens (Human)
Description:
P52333
Residue:
1124
  
Inhibitor
Name:
BDBM497963
Synonyms:
US11008314, Compound 52
Type:
Small organic molecule
Emp. Form.:
C24H26N4O4S2
Mol. Mass.:
498.618
SMILES:
COc1cc(C)c(Sc2cnc(NC(=O)C3CC3)s2)cc1C(=O)N1C[C@@H]2CN([C@@H]2C1)C(=O)C=C
: