Target
Tyrosine-protein kinase ITK/TSK
Ligand
BDBM497985
Substrate
Meas. Tech.
In Vitro Assay
IC50
<10±n/a nM
Citation
 Hudson, RBeausoleil, A Compounds and methods for modulating interleukin-2-inducible t-cell kinase US Patent  US11008314 Publication Date 5/18/2021 
Target
Name:
Tyrosine-protein kinase ITK/TSK
Synonyms:
EMT ITK_HUMAN LYK Tyrosine-protein kinase ITK Tyrosine-protein kinase Lyk
Type:
Protein
Mol. Mass.:
71839.20
Organism:
Homo sapiens (Human)
Description:
Q08881
Residue:
620
  
Inhibitor
Name:
BDBM497985
Synonyms:
US11008314, Compound 73
Type:
Small organic molecule
Emp. Form.:
C23H26N4O3S2
Mol. Mass.:
470.608
SMILES:
Cc1cc(C)c(cc1Sc1cnc(NC(=O)C2CC2)s1)C(=O)N1CCN(CC1)C(=O)C=C
: