Target
Tyrosine-protein kinase TXK
Ligand
BDBM497987
Substrate
Meas. Tech.
In Vitro Assay
IC50
55±n/a nM
Citation
 Hudson, RBeausoleil, A Compounds and methods for modulating interleukin-2-inducible t-cell kinase US Patent  US11008314 Publication Date 5/18/2021 
Target
Name:
Tyrosine-protein kinase TXK
Synonyms:
PTK4 RLK TXK Tyrosine-protein kinase TXK (TXK)
Type:
Protein
Mol. Mass.:
61268.80
Organism:
Homo sapiens (Human)
Description:
P42681
Residue:
527
  
Inhibitor
Name:
BDBM497987
Synonyms:
US11008314, Compound 75
Type:
Small organic molecule
Emp. Form.:
C24H28N4O3S2
Mol. Mass.:
484.634
SMILES:
C[C@@H]1CN(CCN1C(=O)C=C)C(=O)c1cc(Sc2cnc(NC(=O)C3CC3)s2)c(C)cc1C
: