Target
Tyrosine-protein kinase JAK3
Ligand
BDBM497987
Substrate
Meas. Tech.
In Vitro Assay
IC50
550±n/a nM
Citation
 Hudson, RBeausoleil, A Compounds and methods for modulating interleukin-2-inducible t-cell kinase US Patent  US11008314 Publication Date 5/18/2021 
Target
Name:
Tyrosine-protein kinase JAK3
Synonyms:
JAK-3 JAK3_HUMAN Janus kinase 3 (JAK3) L-JAK | Leukocyte janus kinase
Type:
Protein
Mol. Mass.:
125111.08
Organism:
Homo sapiens (Human)
Description:
P52333
Residue:
1124
  
Inhibitor
Name:
BDBM497987
Synonyms:
US11008314, Compound 75
Type:
Small organic molecule
Emp. Form.:
C24H28N4O3S2
Mol. Mass.:
484.634
SMILES:
C[C@@H]1CN(CCN1C(=O)C=C)C(=O)c1cc(Sc2cnc(NC(=O)C3CC3)s2)c(C)cc1C
: