Target
Tyrosine-protein kinase BTK
Ligand
BDBM497987
Substrate
Meas. Tech.
In Vitro Assay
IC50
5500±n/a nM
Citation
 Hudson, RBeausoleil, A Compounds and methods for modulating interleukin-2-inducible t-cell kinase US Patent  US11008314 Publication Date 5/18/2021 
Target
Name:
Tyrosine-protein kinase BTK
Synonyms:
AGMX1 Agammaglobulinaemia tyrosine kinase B cell progenitor kinase BPK BTK_HUMAN Tyrosine Kinase BTK Tyrosine-protein kinase BTK (BTK)
Type:
Enzyme
Mol. Mass.:
76289.95
Organism:
Homo sapiens (Human)
Description:
Q06187
Residue:
659
  
Inhibitor
Name:
BDBM497987
Synonyms:
US11008314, Compound 75
Type:
Small organic molecule
Emp. Form.:
C24H28N4O3S2
Mol. Mass.:
484.634
SMILES:
C[C@@H]1CN(CCN1C(=O)C=C)C(=O)c1cc(Sc2cnc(NC(=O)C3CC3)s2)c(C)cc1C
: