Target
Beta-secretase 1
Ligand
BDBM448204
Substrate
Meas. Tech.
HTRF FRET Assay
Ki
4481±n/a nM
Citation
 Wu, WCumming, JNTaoka, BMDai, X C5-C6-oxacyclic fused iminothiazine dioxide compounds bearing an ether linker as BACE inhibitors, compositions, and their use US Patent  US11008338 Publication Date 5/18/2021 
Target
Name:
Beta-secretase 1
Synonyms:
ASP2 Aspartyl protease 2 BACE1 Beta-secretase (BACE) Beta-secretase 1 (BACE 1) Beta-secretase 1 (BACE1) Beta-site amyloid precursor protein cleaving enzyme 1 Memapsin-2 beta-Secretase (BACE-1) | beta-Secretase (BACE1)
Type:
Protein
Mol. Mass.:
55755.10
Organism:
Homo sapiens (Human)
Description:
P56817
Residue:
501
  
Inhibitor
Name:
BDBM448204
Synonyms:
US10689401, EX 8 | US11008338, Example 8
Type:
Small organic molecule
Emp. Form.:
C20H27FN2O4S
Mol. Mass.:
410.503
SMILES:
C[C@@H]1C[C@@H]2[C@](CO1)(NC(=N)C(C)(C)S2(=O)=O)c1cc(OCC2CC2)ccc1F
: