Target
Beta-secretase 1
Ligand
BDBM448210
Substrate
Meas. Tech.
HTRF FRET Assay
Ki
3.90±n/a nM
Citation
 Wu, WCumming, JNTaoka, BMDai, X C5-C6-oxacyclic fused iminothiazine dioxide compounds bearing an ether linker as BACE inhibitors, compositions, and their use US Patent  US11008338 Publication Date 5/18/2021 
Target
Name:
Beta-secretase 1
Synonyms:
ASP2 Aspartyl protease 2 BACE1 Beta-secretase (BACE) Beta-secretase 1 (BACE 1) Beta-secretase 1 (BACE1) Beta-site amyloid precursor protein cleaving enzyme 1 Memapsin-2 beta-Secretase (BACE-1) | beta-Secretase (BACE1)
Type:
Protein
Mol. Mass.:
55755.10
Organism:
Homo sapiens (Human)
Description:
P56817
Residue:
501
  
Inhibitor
Name:
BDBM448210
Synonyms:
US10689401, EX 14 | US11008338, Example 14
Type:
Small organic molecule
Emp. Form.:
C26H24F3N3O4S
Mol. Mass.:
531.547
SMILES:
CC1(C)C(=N)N[C@]2(CO[C@H](C[C@H]2S1(=O)=O)c1ccc(F)cc1)c1cc(Oc2ncccc2F)ccc1F
: