Target
Beta-secretase 1
Ligand
BDBM448212
Substrate
Meas. Tech.
HTRF FRET Assay
Ki
2861±n/a nM
Citation
 Wu, WCumming, JNTaoka, BMDai, X C5-C6-oxacyclic fused iminothiazine dioxide compounds bearing an ether linker as BACE inhibitors, compositions, and their use US Patent  US11008338 Publication Date 5/18/2021 
Target
Name:
Beta-secretase 1
Synonyms:
ASP2 Aspartyl protease 2 BACE1 Beta-secretase (BACE) Beta-secretase 1 (BACE 1) Beta-secretase 1 (BACE1) Beta-site amyloid precursor protein cleaving enzyme 1 Memapsin-2 beta-Secretase (BACE-1) | beta-Secretase (BACE1)
Type:
Protein
Mol. Mass.:
55755.10
Organism:
Homo sapiens (Human)
Description:
P56817
Residue:
501
  
Inhibitor
Name:
BDBM448212
Synonyms:
US10689401, EX 16 | US11008338, Example 16
Type:
Small organic molecule
Emp. Form.:
C17H23FN2O5S
Mol. Mass.:
386.438
SMILES:
COc1ccc(F)c(c1)[C@]12CO[C@@H](CO)C[C@H]1S(=O)(=O)C(C)(C)C(=N)N2
: