Target
Beta-secretase 2
Ligand
BDBM448221
Substrate
Meas. Tech.
Time-Resolved Endpoint Proteolysis Assay
Ki
66.7±n/a nM
Citation
 Wu, WCumming, JNTaoka, BMDai, X C5-C6-oxacyclic fused iminothiazine dioxide compounds bearing an ether linker as BACE inhibitors, compositions, and their use US Patent  US11008338 Publication Date 5/18/2021 
Target
Name:
Beta-secretase 2
Synonyms:
AEPLC ASP1 Asp 1 Aspartyl protease 1 BACE2_HUMAN Beta-secretase (BACE) Beta-secretase 2 (BACE-2) Beta-site APP-cleaving enzyme 2 Memapsin-1 beta-Secretase (BACE-2)
Type:
Protein
Mol. Mass.:
56171.20
Organism:
Homo sapiens (Human)
Description:
Q9Y5Z0
Residue:
518
  
Inhibitor
Name:
BDBM448221
Synonyms:
US10689401, EX 23 | US11008338, Example 23
Type:
Small organic molecule
Emp. Form.:
C21H31FN2O4S
Mol. Mass.:
426.545
SMILES:
CC(C)COc1ccc(F)c(c1)[C@]12COC(C)(C)C[C@H]1S(=O)(=O)C(C)(C)C(=N)N2
: