Target
D(1A) dopamine receptor
Ligand
BDBM160920
Substrate
Meas. Tech.
Receptor Binding Assay
Ki
82.3±n/a nM
Citation
 Brodney, MADavoren, JEDounay, ABEfremov, IVGray, DLGreen, MEHenderson, JLLee, CMente, SRO''Neil, SVRogers, BNZhang, L Heteroaromatic compounds and their use as dopamine D1 ligands US Patent  US11014909 Publication Date 5/25/2021 
Target
Name:
D(1A) dopamine receptor
Synonyms:
DA D1 receptor DRD1 Dopamine D1 receptor Dopamine D1A
Type:
Enzyme
Mol. Mass.:
49303.43
Organism:
Homo sapiens (Human)
Description:
P21728
Residue:
446
  
Inhibitor
Name:
BDBM160920
Synonyms:
US11014909, Example 10 US9107923, 9
Type:
Small organic molecule
Emp. Form.:
C19H18ClN3O3
Mol. Mass.:
371.818
SMILES:
Cc1cnc(Oc2ccc(c(C)c2)-c2c(C)c(=O)[nH]c(=O)n2C)c(Cl)c1
: