Target
D(1A) dopamine receptor
Ligand
BDBM160927
Substrate
Meas. Tech.
Receptor Binding Assay
Ki
59.1±n/a nM
Citation
 Brodney, MADavoren, JEDounay, ABEfremov, IVGray, DLGreen, MEHenderson, JLLee, CMente, SRO''Neil, SVRogers, BNZhang, L Heteroaromatic compounds and their use as dopamine D1 ligands US Patent  US11014909 Publication Date 5/25/2021 
Target
Name:
D(1A) dopamine receptor
Synonyms:
DA D1 receptor DRD1 Dopamine D1 receptor Dopamine D1A
Type:
Enzyme
Mol. Mass.:
49303.43
Organism:
Homo sapiens (Human)
Description:
P21728
Residue:
446
  
Inhibitor
Name:
BDBM160927
Synonyms:
US11014909, Example 17 US9107923, 17
Type:
Small organic molecule
Emp. Form.:
C19H17F2N3O2
Mol. Mass.:
357.354
SMILES:
Cc1cc(Oc2ncccc2C(F)F)ccc1-c1c(C)n[nH]c(=O)c1C
: