Target
D(1A) dopamine receptor
Ligand
BDBM160929
Substrate
Meas. Tech.
Receptor Binding Assay
Ki
35.7±n/a nM
Citation
 Brodney, MADavoren, JEDounay, ABEfremov, IVGray, DLGreen, MEHenderson, JLLee, CMente, SRO''Neil, SVRogers, BNZhang, L Heteroaromatic compounds and their use as dopamine D1 ligands US Patent  US11014909 Publication Date 5/25/2021 
Target
Name:
D(1A) dopamine receptor
Synonyms:
DA D1 receptor DRD1 Dopamine D1 receptor Dopamine D1A
Type:
Enzyme
Mol. Mass.:
49303.43
Organism:
Homo sapiens (Human)
Description:
P21728
Residue:
446
  
Inhibitor
Name:
BDBM160929
Synonyms:
US11014909, Example 18 | US9107923, 18
Type:
Small organic molecule
Emp. Form.:
C18H16ClN3O2S
Mol. Mass.:
373.857
SMILES:
Cc1cc(Sc2ncccc2Cl)ccc1-c1c(C)c(=O)[nH]c(=O)n1C
: