Target
D(1A) dopamine receptor
Ligand
BDBM498193
Substrate
Meas. Tech.
Receptor Binding Assay
Ki
52.7±n/a nM
Citation
 Brodney, MADavoren, JEDounay, ABEfremov, IVGray, DLGreen, MEHenderson, JLLee, CMente, SRO''Neil, SVRogers, BNZhang, L Heteroaromatic compounds and their use as dopamine D1 ligands US Patent  US11014909 Publication Date 5/25/2021 
Target
Name:
D(1A) dopamine receptor
Synonyms:
DA D1 receptor DRD1 Dopamine D1 receptor Dopamine D1A
Type:
Enzyme
Mol. Mass.:
49303.43
Organism:
Homo sapiens (Human)
Description:
P21728
Residue:
446
  
Inhibitor
Name:
BDBM498193
Synonyms:
6-{4-[(3-ethylpyridin-2-yl)oxy]-2-methylphenyl}-1,5- dimethylpyrimidine-2,4(1H,3H)-dione | US11014909, Example 20
Type:
Small organic molecule
Emp. Form.:
C19H19N3O3
Mol. Mass.:
337.3725
SMILES:
CCc1cccnc1Oc1ccc(cc1)-c1c(C)c(=O)[nH]c(=O)n1C
: