Target
D(1A) dopamine receptor
Ligand
BDBM160893
Substrate
Meas. Tech.
Receptor Binding Assay
Ki
13.4±n/a nM
Citation
 Brodney, MADavoren, JEDounay, ABEfremov, IVGray, DLGreen, MEHenderson, JLLee, CMente, SRO''Neil, SVRogers, BNZhang, L Heteroaromatic compounds and their use as dopamine D1 ligands US Patent  US11014909 Publication Date 5/25/2021 
Target
Name:
D(1A) dopamine receptor
Synonyms:
DA D1 receptor DRD1 Dopamine D1 receptor Dopamine D1A
Type:
Enzyme
Mol. Mass.:
49303.43
Organism:
Homo sapiens (Human)
Description:
P21728
Residue:
446
  
Inhibitor
Name:
BDBM160893
Synonyms:
US10093655, Example 63 US9107923, 63
Type:
Small organic molecule
Emp. Form.:
C20H19F2N3O3
Mol. Mass.:
387.38
SMILES:
COc1ccnc(Oc2ccc(c(C)c2)-c2c(C)n[nH]c(=O)c2C)c1C(F)F
: