Target
D(1A) dopamine receptor
Ligand
BDBM160895
Substrate
Meas. Tech.
Receptor Binding Assay
Ki
26.9±n/a nM
Citation
 Brodney, MADavoren, JEDounay, ABEfremov, IVGray, DLGreen, MEHenderson, JLLee, CMente, SRO''Neil, SVRogers, BNZhang, L Heteroaromatic compounds and their use as dopamine D1 ligands US Patent  US11014909 Publication Date 5/25/2021 
Target
Name:
D(1A) dopamine receptor
Synonyms:
DA D1 receptor DRD1 Dopamine D1 receptor Dopamine D1A
Type:
Enzyme
Mol. Mass.:
49303.43
Organism:
Homo sapiens (Human)
Description:
P21728
Residue:
446
  
Inhibitor
Name:
BDBM160895
Synonyms:
US10093655, Example 66 US9107923, 65
Type:
Small organic molecule
Emp. Form.:
C19H16F3N3O2
Mol. Mass.:
375.3444
SMILES:
Cc1cc(Oc2ncccc2C(F)(F)F)ccc1-c1c(C)n[nH]c(=O)c1C
: