Target
Glycogen synthase kinase-3 beta
Ligand
BDBM498332
Substrate
Meas. Tech.
Biochemical Assay
Ki
0.780±n/a nM
Citation
 Behenna, DCFreeman-Cook, KDHoffman, RLNagata, ANinkovic, SSutton, SC CDK2 inhibitors US Patent  US11014911 Publication Date 5/25/2021 
Target
Name:
Glycogen synthase kinase-3 beta
Synonyms:
GSK-3 beta GSK3B Glycogen synthase kinase 3 beta (GSK3B) Glycogen synthase kinase-3 beta (GSK-3B) Glycogen synthase kinase-3 beta (GSK3B) Glycogen synthase kinase-3beta (GSK3B) | Serine/threonine-protein kinase GSK3B
Type:
Enzyme
Mol. Mass.:
46756.38
Organism:
Homo sapiens (Human)
Description:
P49841
Residue:
420
  
Inhibitor
Name:
BDBM498332
Synonyms:
US11014911, Example 157 US11718603, Example 158
Type:
Small organic molecule
Emp. Form.:
C22H26N6O4
Mol. Mass.:
438.4796
SMILES:
COc1ccc(CC(=O)Nc2cc([nH]n2)[C@H]2CC[C@H](C2)OC(=O)N2C[C@@H](C#N)[C@@H]2C)cn1
: