Target
Cyclin-dependent kinase 2/G1/S-specific cyclin-E1
Ligand
BDBM498397
Substrate
Meas. Tech.
Biochemical Assay
Ki
2.93±n/a nM
Citation
 Behenna, DCFreeman-Cook, KDHoffman, RLNagata, ANinkovic, SSutton, SC CDK2 inhibitors US Patent  US11014911 Publication Date 5/25/2021 
Target
Name:
Cyclin-dependent kinase 2/G1/S-specific cyclin-E1
Synonyms:
CDK2/CycE CDK2/E Cyclin-Dependent Kinase 2 (CDK2) Cyclin-dependent kinase 2/cyclin E1
Type:
Protein
Mol. Mass.:
Description:
Components:
This complex has 2 components.
Component 1
Name:
Cyclin-dependent kinase 2
Synonyms:
CDK2 CDK2_HUMAN Cell division protein kinase 2 Protein cereblon/Cyclin-dependent kinase 2 | p33 protein kinase
Type:
Enzyme Subunit
Mol. Mass.:
33938.17
Organism:
Homo sapiens (Human)
Description:
P24941
Residue:
298
  
Component 2
Name:
G1/S-specific cyclin-E1
Synonyms:
CCNE CCNE1_HUMAN
Type:
Enzyme Subunit
Mol. Mass.:
47073.17
Organism:
Homo sapiens (Human)
Description:
Residue:
410
  
Inhibitor
Name:
BDBM498397
Synonyms:
(1R,3S)-3-(3-{[(5- methoxypyrazin-2- yl)acetyl]amino}-1H-pyrazol-5- yl)cyclopentyl (3,3,3- trifluoropropyl)carbamate US11718603, Example 222
Type:
Small organic molecule
Emp. Form.:
C19H23F3N6O4
Mol. Mass.:
456.4189
SMILES:
COc1cnc(CC(=O)Nc2cc([nH]n2)[C@H]2CC[C@H](C2)OC(=O)NCCC(F)(F)F)cn1
: