Target
Ubiquitin carboxyl-terminal hydrolase 30
Ligand
BDBM498847
Substrate
Meas. Tech.
Biochemical Assay
IC50
550±n/a nM
Citation
 Stockley, MLKemp, MIMadin, AWoodrow, MDJones, A Cyanopyrrolidine derivatives with activity as inhibitors of USP30 US Patent  US11014912 Publication Date 5/25/2021 
Target
Name:
Ubiquitin carboxyl-terminal hydrolase 30
Synonyms:
Deubiquitinating enzyme 30 USP30 Ubiquitin carboxyl-terminal hydrolase 30 (USP30) Ubiquitin-specific-processing protease 30
Type:
Protein
Mol. Mass.:
58522.90
Organism:
Homo sapiens (Human)
Description:
Q70CQ3
Residue:
517
  
Inhibitor
Name:
BDBM498847
Synonyms:
2-(1-Cyanopyrrolidin-3- ylidene)-N-(quinolin-3- yl)acetamide | US11014912, Example 23
Type:
Small organic molecule
Emp. Form.:
C16H14N4O
Mol. Mass.:
278.3086
SMILES:
O=C(Nc1cnc2ccccc2c1)C=C1CCN(C1)C#N
: