Target
Protein mono-ADP-ribosyltransferase TIPARP
Ligand
BDBM431580
Substrate
Meas. Tech.
Enzymatic Assay
IC50
<100±n/a nM
Citation
 Vasbinder, MMSchenkel, LBSwinger, KKKuntz, KW Pyridazinones as PARP7 inhibitors US Patent  US11014913 Publication Date 5/25/2021 
Target
Name:
Protein mono-ADP-ribosyltransferase TIPARP
Synonyms:
ADP-ribosyltransferase diphtheria toxin-like 14 PARP-7 PARPT_HUMAN TCDD-inducible poly [ADP-ribose] polymerase | TIPARP
Type:
Protein
Mol. Mass.:
76228.44
Organism:
Human
Description:
Q7Z3E1
Residue:
657
  
Inhibitor
Name:
BDBM431580
Synonyms:
US10550105, Example 521 US11014913, Example 521
Type:
Small organic molecule
Emp. Form.:
C19H21ClN6O4
Mol. Mass.:
432.861
SMILES:
Clc1c(OCCOCCC(=O)N2CCN(CC2)c2ccc(cn2)C#N)cn[nH]c1=O
: