Target
Coagulation factor XII
Ligand
BDBM498908
Substrate
Meas. Tech.
Factor XIIa assay
IC50
82.9±n/a nM
Citation
 Hicks, JDMcKittrick, BAWhitehead, BRLombardo, MHan, XTaylor, JAChu, HDSo, SOrth, PWu, Z Factor XIIa inhibitors US Patent  US11014920 Publication Date 5/25/2021 
Target
Name:
Coagulation factor XII
Synonyms:
Beta-factor XIIa part 1 Carboxylesterase 2 (intestine, liver) Coagulation factor XII (FXII) Coagulation factor XIIa light chain FA12_HUMAN Factor XIIa (fXIIa) Hageman factor
Type:
Enzyme
Mol. Mass.:
67810.07
Organism:
Homo sapiens (Human)
Description:
P00748
Residue:
615
  
Inhibitor
Name:
BDBM498908
Synonyms:
N-{(3S,4R)-1-(N- cyclohexyl-3-piperidin- 4-ylalanyl)-3- [(thiophen-2- ylmethyl)carbamoyl]pi- peridin-4-yl}-6- azaspiro[2.5]octane-6- carboxarnide | US11014920, Compound 16
Type:
Small organic molecule
Emp. Form.:
C33H52N6O3S
Mol. Mass.:
612.869
SMILES:
O=C(NCc1cccs1)[C@H]1CN(CC[C@H]1NC(=O)N1CCC2(CC2)CC1)C(=O)C(CC1CCNCC1)NC1CCCCC1
: