Target
CREB-binding protein
Ligand
BDBM437404
Substrate
Meas. Tech.
In Vitro CBP Inhibition
IC50
<500±n/a nM
Citation
 Trzoss, LBetancort, JMKanouni, TWallace, MBBoloor, A Therapeutic compounds US Patent  US11020380 Publication Date 6/1/2021 
Target
Name:
CREB-binding protein
Synonyms:
CBP CREB-binding protein (CBP) CREBBP
Type:
Transcription Coactivator
Mol. Mass.:
265411.66
Organism:
Homo sapiens (Human)
Description:
Q92793
Residue:
2442
  
Inhibitor
Name:
BDBM437404
Synonyms:
5-(1-isopropyl-1H-pyrazol-4-yl)-1-methyl-4- phenylpyridin-2(1H)-one US11020380, Example 138
Type:
Small organic molecule
Emp. Form.:
C18H19N3O
Mol. Mass.:
293.363
SMILES:
CC(C)n1cc(cn1)-c1cn(C)c(=O)cc1-c1ccccc1
: