Target
Beta-secretase 2
Ligand
BDBM501249
Substrate
Meas. Tech.
In Vitro Enzymatic BACE1 and BACE2 FRET (Fluorescence Resonance Energy Transfer) Assays
IC50
10.00±n/a nM
Citation
 Allen, JRBourbeau, MPBrown, JAChen, NFrohn, MJFu, ZLiu, LLiu, QPettus, LHQian, WReeves, CSiegmund, AC 1,4-thiazine dioxide and 1,2,4-thiadiazine dioxide derivatives as beta-secretase inhibitors and methods of use US Patent  US11021493 Publication Date 6/1/2021 
Target
Name:
Beta-secretase 2
Synonyms:
AEPLC ASP1 Asp 1 Aspartyl protease 1 BACE2_HUMAN Beta-secretase (BACE) Beta-secretase 2 (BACE-2) Beta-site APP-cleaving enzyme 2 Memapsin-1 beta-Secretase (BACE-2)
Type:
Protein
Mol. Mass.:
56171.20
Organism:
Homo sapiens (Human)
Description:
Q9Y5Z0
Residue:
518
  
Inhibitor
Name:
BDBM501249
Synonyms:
US11021493, Example 168
Type:
Small organic molecule
Emp. Form.:
C21H21F2N5O3S
Mol. Mass.:
461.485
SMILES:
CC#CCOc1cnc(cn1)C(\F)=C\c1ccc(F)c(c1)[C@]1(C)CS(=O)(=O)N(C)C(N)=N1
: