Target
Cathepsin D
Ligand
BDBM501249
Substrate
Meas. Tech.
In Vitro Enzymatic Cathepsin D (CatD) FRET Assay
IC50
25400±n/a nM
Citation
 Allen, JRBourbeau, MPBrown, JAChen, NFrohn, MJFu, ZLiu, LLiu, QPettus, LHQian, WReeves, CSiegmund, AC 1,4-thiazine dioxide and 1,2,4-thiadiazine dioxide derivatives as beta-secretase inhibitors and methods of use US Patent  US11021493 Publication Date 6/1/2021 
Target
Name:
Cathepsin D
Synonyms:
CATD_HUMAN CTSD Cathepsin D heavy chain Cathepsin D precursor
Type:
Enzyme
Mol. Mass.:
44551.72
Organism:
Homo sapiens (Human)
Description:
Human proCathepsin D (SwissProt accession number P07339) was expressed in Sf9 cells, purified, and autoactivated.
Residue:
412
  
Inhibitor
Name:
BDBM501249
Synonyms:
US11021493, Example 168
Type:
Small organic molecule
Emp. Form.:
C21H21F2N5O3S
Mol. Mass.:
461.485
SMILES:
CC#CCOc1cnc(cn1)C(\F)=C\c1ccc(F)c(c1)[C@]1(C)CS(=O)(=O)N(C)C(N)=N1
: