Target
Beta-secretase 1
Ligand
BDBM501280
Substrate
Meas. Tech.
In Vitro Enzymatic BACE1 and BACE2 FRET (Fluorescence Resonance Energy Transfer) Assays
IC50
4.00±n/a nM
Citation
 Allen, JRBourbeau, MPBrown, JAChen, NFrohn, MJFu, ZLiu, LLiu, QPettus, LHQian, WReeves, CSiegmund, AC 1,4-thiazine dioxide and 1,2,4-thiadiazine dioxide derivatives as beta-secretase inhibitors and methods of use US Patent  US11021493 Publication Date 6/1/2021 
Target
Name:
Beta-secretase 1
Synonyms:
ASP2 Aspartyl protease 2 BACE1 Beta-secretase (BACE) Beta-secretase 1 (BACE 1) Beta-secretase 1 (BACE1) Beta-site amyloid precursor protein cleaving enzyme 1 Memapsin-2 beta-Secretase (BACE-1) | beta-Secretase (BACE1)
Type:
Protein
Mol. Mass.:
55755.10
Organism:
Homo sapiens (Human)
Description:
P56817
Residue:
501
  
Inhibitor
Name:
BDBM501280
Synonyms:
US11021493, Example 199
Type:
Small organic molecule
Emp. Form.:
C25H28F2N4O3S
Mol. Mass.:
502.577
SMILES:
CC[C@@H](Oc1cnc(cn1)C(\F)=C\c1ccc(F)c(c1)[C@]1(C)CS(=O)(=O)C(C)(C)C(N)=N1)C#CC
: