Target
Dual specificity calcium/calmodulin-dependent 3',5'-cyclic nucleotide phosphodiesterase 1A
Ligand
BDBM279024
Substrate
Meas. Tech.
Inhibition Assay
IC50
0.390±n/a nM
Citation
 Kehler, JJuhl, KMarigo, MVital, PJJessing, MLanggård, MRasmussen, LKClementson, CM 1H-pyrazolo[4,3-b]pyridines as PDE1 inhibitors US Patent  US11026923 Publication Date 6/8/2021 
Target
Name:
Dual specificity calcium/calmodulin-dependent 3',5'-cyclic nucleotide phosphodiesterase 1A
Synonyms:
61 kDa Cam-PDE Cam-PDE 1A PDE1A_HUMAN | hCam-1
Type:
Protein
Mol. Mass.:
61245.69
Organism:
Homo sapiens (Human)
Description:
P54750
Residue:
535
  
Inhibitor
Name:
BDBM279024
Synonyms:
N-[(1,5-dimethylpyrazol-3-yl)methyl]-5-(2-ethoxy-3-pyridyl)-1-isopropyl-3-methyl-pyrazolo[4,3-b]pyridin-7-amine US10512632, Example 54 US11026923, Example 54 US11634416, Example 54
Type:
Small organic molecule
Emp. Form.:
C23H29N7O
Mol. Mass.:
419.5227
SMILES:
CCOc1ncccc1-c1cc(NCc2cc(C)n(C)n2)c2n(nc(C)c2n1)C(C)C
: