Target
Dual specificity calcium/calmodulin-dependent 3',5'-cyclic nucleotide phosphodiesterase 1B
Ligand
BDBM501437
Substrate
Meas. Tech.
Inhibition Assay
IC50
0.140±n/a nM
Citation
 Kehler, JJuhl, KMarigo, MVital, PJJessing, MLanggård, MRasmussen, LKClementson, CM 1H-pyrazolo[4,3-b]pyridines as PDE1 inhibitors US Patent  US11026923 Publication Date 6/8/2021 
Target
Name:
Dual specificity calcium/calmodulin-dependent 3',5'-cyclic nucleotide phosphodiesterase 1B
Synonyms:
63 kDa Cam-PDE Calcium/calmodulin-dependent 3',5'-cyclic nucleotide phosphodiesterase 1B PDE1B PDE1B_HUMAN Phosphodiesterase 1B Phosphodiesterase Type 1 (PDE1B) | Phosphodiesterase, PDE1/PDE5
Type:
Enzyme
Mol. Mass.:
61366.51
Organism:
Homo sapiens (Human)
Description:
Residue:
536
  
Inhibitor
Name:
BDBM501437
Synonyms:
3-methyl-1-[1-methylpropyl]-N-[(2- methyltetrazol-5-yl]methyl]-5-(2-prepoxy-3- pyridyl)pyrazolo[4,3-b]pyridin-7-amine, enantiomer 2 | US11026923, Example 68
Type:
Small organic molecule
Emp. Form.:
C22H32N8O
Mol. Mass.:
424.5425
SMILES:
CCCOc1ncccc1C\C=C(\NCc1nnn(C)n1)c1cc(C)nn1C(C)CC
: