Target
Macrophage colony-stimulating factor 1 receptor
Ligand
BDBM501706
Substrate
Meas. Tech.
Biochemical Assay
IC50
<100±n/a nM
Citation
 Gamage, SAShepherd, PRFlanagan, JURewcastle, GWMarshall, AJBuchanan, CMLu, GBonnet, MJamieson, SMDenny, WA Tricyclic heterocyclic derivatives and uses thereof US Patent  US11028064 Publication Date 6/8/2021 
Target
Name:
Macrophage colony-stimulating factor 1 receptor
Synonyms:
CSF1R FMS Macrophage colony stimulating factor receptor Macrophage colony-stimulating factor 1 receptor (c-FMS) Proto-oncogene c-Fms c-fms | cFMS
Type:
Protein
Mol. Mass.:
107979.48
Organism:
Homo sapiens (Human)
Description:
P07333
Residue:
972
  
Inhibitor
Name:
BDBM501706
Synonyms:
(2-(Dimethylamino)ethoxy)-6-(6-((4-methoxybenzyl)oxy)nicotinoyl)-2-methyl-9H-xanthen-9-one | US11028064, Example 20
Type:
Small organic molecule
Emp. Form.:
C33H32N2O5
Mol. Mass.:
536.6176
SMILES:
CN(C)CCOc1cc(C)cc2c1oc1cc(ccc1c2=O)C(=O)c1ccc(CCc2ccc(CO)cc2)nc1
: