Target
Vascular endothelial growth factor receptor 2
Ligand
BDBM501712
Substrate
Meas. Tech.
Biochemical Assay
IC50
>10000±n/a nM
Citation
 Gamage, SAShepherd, PRFlanagan, JURewcastle, GWMarshall, AJBuchanan, CMLu, GBonnet, MJamieson, SMDenny, WA Tricyclic heterocyclic derivatives and uses thereof US Patent  US11028064 Publication Date 6/8/2021 
Target
Name:
Vascular endothelial growth factor receptor 2
Synonyms:
CD_antigen=CD309 Fetal liver kinase 1 (FLK-1) KDR Protein-tyrosine kinase receptor Flk-1 VEGFR-2 VEGFR2 Vascular Endothelial Growth Factor Receptor Kinase 2 Vascular endothelial growth factor receptor 2 (KDR) Vascular endothelial growth factor receptor 2 (VEGFR2) Vascular endothelial growth factor receptor-2 (VEGFR-2)
Type:
Receptor Tyrosine Kinase
Mol. Mass.:
151510.97
Organism:
Homo sapiens (Human)
Description:
P35968
Residue:
1356
  
Inhibitor
Name:
BDBM501712
Synonyms:
N-(2-(5-((5-(2-(Dimethylamino)ethoxy)-7-methyl-9-oxo-9H-xanthen-3-yl)oxy)pyridin-2-yl)ethyl)cyclopentanecarboxamide | US11028064, Example 26
Type:
Small organic molecule
Emp. Form.:
C31H35N3O5
Mol. Mass.:
529.6267
SMILES:
CN(C)CCOc1cc(C)cc2c1oc1cc(Oc3ccc(CCNC(=O)C4CCCC4)nc3)ccc1c2=O
: