Target
Macrophage colony-stimulating factor 1 receptor
Ligand
BDBM501737
Substrate
Meas. Tech.
Biochemical Assay
IC50
<100±n/a nM
Citation
 Gamage, SAShepherd, PRFlanagan, JURewcastle, GWMarshall, AJBuchanan, CMLu, GBonnet, MJamieson, SMDenny, WA Tricyclic heterocyclic derivatives and uses thereof US Patent  US11028064 Publication Date 6/8/2021 
Target
Name:
Macrophage colony-stimulating factor 1 receptor
Synonyms:
CSF1R FMS Macrophage colony stimulating factor receptor Macrophage colony-stimulating factor 1 receptor (c-FMS) Proto-oncogene c-Fms c-fms | cFMS
Type:
Protein
Mol. Mass.:
107979.48
Organism:
Homo sapiens (Human)
Description:
P07333
Residue:
972
  
Inhibitor
Name:
BDBM501737
Synonyms:
N-Cyclopentyl-3-(5-((5-(2-(dimethylamino)ethoxy)-7-methyl-9-oxo-9H-thioxanthen-3-yl)oxy)pyridin-2-yl)propanamide | US11028064, Example 51
Type:
Small organic molecule
Emp. Form.:
C31H35N3O4S
Mol. Mass.:
545.692
SMILES:
CN(C)CCOc1cc(C)cc2c1sc1cc(Oc3ccc(CCC(=O)NC4CCCC4)nc3)ccc1c2=O
: