Target
Macrophage colony-stimulating factor 1 receptor
Ligand
BDBM501745
Substrate
Meas. Tech.
Biochemical Assay
IC50
<100±n/a nM
Citation
 Gamage, SAShepherd, PRFlanagan, JURewcastle, GWMarshall, AJBuchanan, CMLu, GBonnet, MJamieson, SMDenny, WA Tricyclic heterocyclic derivatives and uses thereof US Patent  US11028064 Publication Date 6/8/2021 
Target
Name:
Macrophage colony-stimulating factor 1 receptor
Synonyms:
CSF1R FMS Macrophage colony stimulating factor receptor Macrophage colony-stimulating factor 1 receptor (c-FMS) Proto-oncogene c-Fms c-fms | cFMS
Type:
Protein
Mol. Mass.:
107979.48
Organism:
Homo sapiens (Human)
Description:
P07333
Residue:
972
  
Inhibitor
Name:
BDBM501745
Synonyms:
N-Cyclopentyl-3-(5-((7-methyl-9-oxo-5-(2-(4-(2,2,2-trifluoroethyl)piperazin-1-yl)ethoxy)-9H-xanthen-3-yl)oxy)pyridin-2-yl)propanamide | US11028064, Example 59
Type:
Small organic molecule
Emp. Form.:
C35H39F3N4O5
Mol. Mass.:
652.7032
SMILES:
Cc1cc(OCCN2CCN(CC(F)(F)F)CC2)c2oc3cc(Oc4ccc(CCC(=O)NC5CCCC5)nc4)ccc3c(=O)c2c1
: