Target
Vascular endothelial growth factor receptor 2
Ligand
BDBM501760
Substrate
Meas. Tech.
Biochemical Assay
IC50
>10000±n/a nM
Citation
 Gamage, SAShepherd, PRFlanagan, JURewcastle, GWMarshall, AJBuchanan, CMLu, GBonnet, MJamieson, SMDenny, WA Tricyclic heterocyclic derivatives and uses thereof US Patent  US11028064 Publication Date 6/8/2021 
Target
Name:
Vascular endothelial growth factor receptor 2
Synonyms:
CD_antigen=CD309 Fetal liver kinase 1 (FLK-1) KDR Protein-tyrosine kinase receptor Flk-1 VEGFR-2 VEGFR2 Vascular Endothelial Growth Factor Receptor Kinase 2 Vascular endothelial growth factor receptor 2 (KDR) Vascular endothelial growth factor receptor 2 (VEGFR2) Vascular endothelial growth factor receptor-2 (VEGFR-2)
Type:
Receptor Tyrosine Kinase
Mol. Mass.:
151510.97
Organism:
Homo sapiens (Human)
Description:
P35968
Residue:
1356
  
Inhibitor
Name:
BDBM501760
Synonyms:
N-Cyclopentyl-3-(5-((7-methyl-5-((1-methylpiperidin-2-yl)methoxy)-9-oxo-9H-xanthen-3-yl)oxy)pyridin-2-yl)propanamide | US11028064, Example 74
Type:
Small organic molecule
Emp. Form.:
C34H39N3O5
Mol. Mass.:
569.6906
SMILES:
CN1CCCCC1COc1cc(C)cc2c1oc1cc(Oc3ccc(CCC(=O)NC4CCCC4)nc3)ccc1c2=O
: